{"text_format":"1","workbook":"xlsx","n_sheets":17,"sheets":["Individual Cost Statement","Personnel_EMPLOYEES","Personnel_NON_EMPLOYEES","Travel","External assistance","Infrastructure","Equipment","Prototype","Land_purchase","Land_Lease_Compensation","Consumables","Other direct costs","Funding","Certificate_NATURE_projects","Certificate_INTEGRATED_projects","VAT_Calculation","LISTS"],"not_rendered":{"charts":0,"images":14,"macros":1,"external_links":0,"defined_names":23,"comments":1,"pivot_tables":0},"unopened":[],"bounds":{"document_bytes":16777216,"sheet_cells":100000,"rows_first":2000,"rows_last":500,"rows_between":2000,"halvings":0,"cell_chars":16384,"cell_head_chars":4096},"cells_cut":0,"cells_raw":0,"read":"whole","date_system":"1900"}

{"sheet":"Individual Cost Statement","index":0,"n_rows":35,"n_cols":8,"rows_kept":35,"cut":false,"hidden":false,"merged":[[26,0,26,5],[33,0,33,5],[34,1,34,5],[27,3,27,5],[27,0,27,2],[24,3,24,5],[24,0,24,2],[25,0,25,4],[0,0,0,5],[5,1,5,5],[23,0,23,1],[2,1,2,2],[2,4,2,5],[3,4,3,5],[7,1,7,2],[6,1,6,2],[7,4,7,5]]}
["FINANCIAL STATEMENT of the INDIVIDUAL Beneficiary"]
[]
["PROJECT reference :","LIFEXX XXX/XX/XXXXXX - ACRONYM",null,"PERIOD (FROM) :"]
["COUNTRY CODE :","Austria",{"$f":"VLOOKUP(B4,LISTS!A1:B36,2,)","v":"AT"},"PERIOD (TO) :"]
[]
["NAME OF BENEFICIARY : "]
{"$rows_left_out":30}
{"sheet":"Personnel_EMPLOYEES","index":1,"n_rows":89,"n_cols":22,"rows_kept":89,"cut":false,"hidden":false,"merged":[[77,1,77,20],[63,0,63,20],[70,1,70,20],[64,0,64,20],[2,18,2,20],[65,1,65,20],[1,18,1,20],[0,18,0,20],[57,0,57,19],[4,13,4,20],[0,2,0,4],[1,2,1,4],[2,2,2,4],[1,11,1,12],[0,11,0,12],[1,13,1,14],[0,13,0,14],[4,1,4,4],[4,5,4,6],[4,7,4,12]]}
[null,"PROJECT Reference :",{"$f":"'Individual Cost Statement'!B3:B3","v":"LIFEXX XXX/XX/XXXXXX - ACRONYM"},null,null,null,null,null,null,null,null,"PERIOD (FROM) :",null,{"$f":"'Individual Cost Statement'!E3:E3","v":"00:00:00"},null,null,null,null,"Personnel_EMPLOYEES"]
[null,"COUNTRY :",{"$f":"'Individual Cost Statement'!B4:B4","v":"Austria"},null,null,null,null,null,null,null,null,"PERIOD (TO) :",null,{"$f":"'Individual Cost Statement'!E4:E4","v":"00:00:00"},null,null,null,null,"Total annual costs claimed"]
[null,"Beneficiary: ",{"$f":"'Individual Cost Statement'!B6:B6","v":0},null,null,null,null,null,null,null,null,null,null,null,null,null,null,null,{"$f":"U58","v":0}]
[]
[null,"General information on staff assigned to the project",null,null,null,"Employment period",null,"Information on the working hours",null,null,null,null,null,"Calculation of the PERSONNEL EMPLOYEES costs"]
["A","B1","B2","B3","B4","C1","C2","D1","D2","D3","D4","D5","D6","E1","E2","E3","E4","E5","E6","E7","E8"]
{"$rows_left_out":84}
{"sheet":"Personnel_NON_EMPLOYEES","index":2,"n_rows":86,"n_cols":21,"rows_kept":86,"cut":false,"hidden":false,"merged":[[57,0,57,13],[0,2,0,4],[0,7,0,8],[0,9,0,10],[1,2,1,4],[1,7,1,8],[1,9,1,10],[2,2,2,4],[4,1,4,4],[4,5,4,6],[4,10,4,17],[0,12,0,14],[1,12,1,14],[4,7,4,9],[65,1,65,17],[75,1,75,17],[64,0,64,17],[2,12,2,14],[84,1,84,17],[63,0,63,17],[66,1,66,17],[67,1,67,17],[68,1,68,17],[70,1,70,17],[71,1,71,17],[72,1,72,17],[74,1,74,17],[69,1,69,17],[81,1,81,17],[73,1,73,17],[85,1,85,17],[76,1,76,17],[77,1,77,17],[78,1,78,17],[79,1,79,17],[82,1,82,17],[83,1,83,17]]}
[null,"PROJECT Reference :",{"$f":"'Individual Cost Statement'!B3:B3","v":"LIFEXX XXX/XX/XXXXXX - ACRONYM"},null,null,null,null,"PERIOD (FROM) :",null,{"$f":"'Individual Cost Statement'!E3:E3","v":"00:00:00"},null,null,"Personnel_NON-EMPLOYEES"]
[null,"COUNTRY :",{"$f":"'Individual Cost Statement'!B4:B4","v":"Austria"},null,null,null,null,"PERIOD (TO) :",null,{"$f":"'Individual Cost Statement'!E4:E4","v":"00:00:00"},null,null,"Amount claimed WITH NON-recoverable VAT"]
[null,"Beneficiary: ",{"$f":"'Individual Cost Statement'!B6:B6","v":0},null,null,null,null,null,null,null,null,null,{"$f":"R58","v":0}]
[]
[null,"General information on staff assigned to the project",null,null,null,"Employment period",null,"Info on working hours",null,null,"Calculation of the PERSONNEL NON-EMPLOYEES costs"]
["A","B1","B2","B3","B4","C1","C2","D1","D2","D3","E1","E2","E3","E4","E5","E6","E7","E8"]
{"$rows_left_out":81}
{"sheet":"Travel","index":3,"n_rows":83,"n_cols":20,"rows_kept":83,"cut":false,"hidden":false,"merged":[[73,1,73,15],[74,1,74,15],[75,1,75,15],[68,1,68,15],[69,1,69,15],[70,1,70,15],[71,1,71,15],[72,1,72,15],[81,1,81,15],[82,1,82,15],[76,1,76,15],[77,1,77,15],[78,1,78,15],[79,1,79,15],[80,1,80,15],[4,8,4,10],[4,11,4,15],[57,0,57,12],[66,1,66,15],[67,1,67,15],[63,0,63,15],[64,0,64,15],[65,1,65,15],[4,1,4,5],[4,6,4,7],[0,13,0,15],[1,13,1,15],[2,13,2,15],[0,2,0,4],[1,2,1,4],[2,2,2,4],[0,7,0,8],[0,9,0,10],[1,7,1,8],[1,9,1,10]]}
[null,"PROJECT Reference :",{"$f":"'Individual Cost Statement'!B3:B3","v":"LIFEXX XXX/XX/XXXXXX - ACRONYM"},null,null,null,null,"PERIOD (FROM) :",null,{"$f":"'Individual Cost Statement'!E3:E3","v":"00:00:00"},null,null,null,"TRAVEL"]
[null,"COUNTRY :",{"$f":"'Individual Cost Statement'!B4:B4","v":"Austria"},null,null,null,null,"PERIOD (TO) :",null,{"$f":"'Individual Cost Statement'!E4:E4","v":"00:00:00"},null,null,null,"Amount WITH NON-recoverable VAT"]
[null,"Beneficiary: ",{"$f":"'Individual Cost Statement'!B6:B6","v":0},null,null,null,null,null,null,null,null,null,null,{"$f":"P58","v":0}]
[]
[null,"General information on travel costs",null,null,null,null,"Info on cost item",null,"Details on cost item",null,null,"Calculation of the TRAVEL & SUBSISTENCE costs"]
["A","B1","B2","B3","B4","B5","C1","C2","D1","D2","D3","E1","E2","E3","E4","E5"]
{"$rows_left_out":78}
{"sheet":"External assistance","index":4,"n_rows":81,"n_cols":17,"rows_kept":81,"cut":false,"hidden":false,"merged":[[78,1,78,13],[79,1,79,13],[80,1,80,13],[73,1,73,13],[74,1,74,13],[75,1,75,13],[76,1,76,13],[77,1,77,13],[63,0,63,13],[64,0,64,13],[65,1,65,13],[66,1,66,13],[67,1,67,13],[68,1,68,13],[69,1,69,13],[70,1,70,13],[71,1,71,13],[72,1,72,13],[2,2,2,4],[0,2,0,4],[1,2,1,4],[57,0,57,10],[4,1,4,3],[4,4,4,7],[4,8,4,12],[1,6,1,7],[0,6,0,7],[0,10,0,12],[1,10,1,12],[2,10,2,12]]}
[null,"PROJECT Reference :",{"$f":"'Individual Cost Statement'!B3:B3","v":"LIFEXX XXX/XX/XXXXXX - ACRONYM"},null,null,null,"PERIOD (FROM) :",null,{"$f":"'Individual Cost Statement'!E3:E3","v":"00:00:00"},null,"EXTERNAL ASSISTANCE"]
[null,"COUNTRY :",{"$f":"'Individual Cost Statement'!B4:B4","v":"Austria"},null,null,null,"PERIOD (TO) :",null,{"$f":"'Individual Cost Statement'!E4:E4","v":"00:00:00"},null,"Amount WITH NON-recoverable VAT"]
[null,"Beneficiary: ",{"$f":"'Individual Cost Statement'!B6:B6","v":0},null,null,null,null,null,null,null,{"$f":"M58","v":0}]
[]
[null,"Details on cost item",null,null,"Info on cost item",null,null,null,"Calculation of the EXTERNAL ASSISTANCE costs",null,null,null,null,"Selection procedure"]
["A","B1","B2","B3","C1","C2","C3","C4","D1","D2","D3","D4","D5","F"]
{"$rows_left_out":76}
{"sheet":"Infrastructure","index":5,"n_rows":83,"n_cols":19,"rows_kept":83,"cut":false,"hidden":false,"merged":[[64,2,64,15],[77,1,77,15],[82,1,82,15],[0,2,0,4],[1,2,1,4],[4,4,4,5],[4,6,4,14],[57,0,57,10],[4,1,4,3],[0,6,0,7],[1,6,1,7],[0,11,0,14],[2,11,2,12],[1,11,1,12],[1,13,1,14],[2,13,2,14],[2,2,2,4],[63,2,63,15]]}
[null,"PROJECT Reference :",{"$f":"'Individual Cost Statement'!B3:B3","v":"LIFEXX XXX/XX/XXXXXX - ACRONYM"},null,null,null,"PERIOD (FROM) :",null,{"$f":"'Individual Cost Statement'!E3:E3","v":"00:00:00"},null,null,"INFRASTRUCTURE"]
[null,"COUNTRY :",{"$f":"'Individual Cost Statement'!B4:B4","v":"Austria"},null,null,null,"PERIOD (TO) :",null,{"$f":"'Individual Cost Statement'!E4:E4","v":"00:00:00"},null,null,"Invoiced amount WITH non-rec VAT",null,"Depreciated amount WITH non-rec VAT"]
[null,"Beneficiary: ",{"$f":"'Individual Cost Statement'!B6:B6","v":0},null,null,null,null,null,null,null,null,{"$f":"M58","v":0},null,{"$f":"O58","v":0}]
[]
[null,"Details on cost item",null,null,"Info on cost item",null,"Calculation of the INFRASTRUCTURE DEPRECIATION costs",null,null,null,null,null,null,null,null,"Selection procedure"]
["A","B1","B2","B3","C1","C2","D1","D2","D3","D4","D5","D6","D7","D8","D9","F"]
{"$rows_left_out":78}
{"sheet":"Equipment","index":6,"n_rows":83,"n_cols":19,"rows_kept":83,"cut":false,"hidden":false,"merged":[[0,6,0,7],[1,6,1,7],[63,0,63,15],[64,0,64,15],[0,11,0,14],[1,11,1,12],[1,13,1,14],[0,2,0,4],[1,2,1,4],[77,1,77,15],[82,1,82,15],[2,11,2,12],[2,13,2,14],[57,0,57,10],[4,1,4,3],[4,4,4,5],[4,6,4,14],[2,2,2,4]]}
[null,"PROJECT Reference :",{"$f":"'Individual Cost Statement'!B3:B3","v":"LIFEXX XXX/XX/XXXXXX - ACRONYM"},null,null,null,"PERIOD (FROM) :",null,{"$f":"'Individual Cost Statement'!E3:E3","v":"00:00:00"},null,null,"EQUIPMENT"]
[null,"COUNTRY :",{"$f":"'Individual Cost Statement'!B4:B4","v":"Austria"},null,null,null,"PERIOD (TO) :",null,{"$f":"'Individual Cost Statement'!E4:E4","v":"00:00:00"},null,null,"Invoiced amount WITH non-rec VAT",null,"Depreciated amount WITH non-rec VAT"]
[null,"Beneficiary: ",{"$f":"'Individual Cost Statement'!B6:B6","v":0},null,null,null,null,null,null,null,null,{"$f":"M58","v":0},null,{"$f":"O58","v":0}]
[]
[null,"Details on cost item",null,null,"Info on cost item",null,"Calculation of the EQUIPMENT DEPRECIATION costs",null,null,null,null,null,null,null,null,"Selection procedure"]
["A","B2","B3","B4","C1","C2","D1","D2","D3","D4","D5","D6","D7","D8","D9","F"]
{"$rows_left_out":78}
{"sheet":"Prototype","index":7,"n_rows":79,"n_cols":15,"rows_kept":79,"cut":false,"hidden":false,"merged":[[57,0,57,8],[78,1,78,11],[75,1,75,11],[74,1,74,11],[63,0,63,11],[64,0,64,11],[69,1,69,11],[4,4,4,5],[4,6,4,10],[4,1,4,3],[0,2,0,4],[1,2,1,4],[0,8,0,10],[1,8,1,10],[2,8,2,10],[2,2,2,4]]}
[null,"PROJECT Reference :",{"$f":"'Individual Cost Statement'!B3:B3","v":"LIFEXX XXX/XX/XXXXXX - ACRONYM"},null,null,null,"PERIOD (FROM) :",{"$f":"'Individual Cost Statement'!E3:E3","v":"00:00:00"},"PROTOTYPE"]
[null,"COUNTRY :",{"$f":"'Individual Cost Statement'!B4:B4","v":"Austria"},null,null,null,"PERIOD (TO) :",{"$f":"'Individual Cost Statement'!E4:E4","v":"00:00:00"},"Amount WITH NON-recoverable VAT"]
[null,"Beneficiary: ",{"$f":"'Individual Cost Statement'!B6:B6","v":0},null,null,null,null,null,{"$f":"K58","v":0}]
[]
[null,"Details on cost item",null,null,"Info on cost item",null,"Calculation of the PROTOTYPE costs",null,null,null,null,"Selection procedure"]
["A","B1","B2","B3","C1","C2","D1","D2","D3","D4","D5","F"]
{"$rows_left_out":74}
{"sheet":"Land_purchase","index":8,"n_rows":85,"n_cols":21,"rows_kept":85,"cut":false,"hidden":false,"merged":[[57,0,57,15],[0,2,0,4],[1,2,1,4],[2,2,2,4],[4,1,4,4],[0,15,0,17],[1,15,1,17],[2,15,2,17],[4,8,5,8],[4,5,4,7],[4,9,4,17],[73,1,73,17],[82,1,82,17],[81,1,81,17],[64,0,64,17],[63,0,63,17]]}
[null,"PROJECT Reference :",{"$f":"'Individual Cost Statement'!B3:B3","v":"LIFEXX XXX/XX/XXXXXX - ACRONYM"},null,null,null,null,"PERIOD (FROM) :",{"$f":"'Individual Cost Statement'!E3:E3","v":"00:00:00"},null,null,null,null,null,null,"LAND PURCHASE"]
[null,"COUNTRY :",{"$f":"'Individual Cost Statement'!B4:B4","v":"Austria"},null,null,null,null,"PERIOD (TO) :",{"$f":"'Individual Cost Statement'!E4:E4","v":"00:00:00"},null,null,null,null,null,null,"Amount WITH NON-recoverable VAT"]
[null,"Beneficiary: ",{"$f":"'Individual Cost Statement'!B6:B6","v":0},null,null,null,null,null,null,null,null,null,null,null,null,{"$f":"R58","v":0}]
[]
[null,"Info on land",null,null,null,"Info on Notarial Act",null,null,"D","Calculation of the LAND PURCHASE costs"]
["A","B1","B2","B3","B4","C1","C2","C3",null,"E1","E2","E3","E4","E5","E6","E7","E8","E9"]
{"$rows_left_out":80}
{"sheet":"Land_Lease_Compensation","index":9,"n_rows":85,"n_cols":21,"rows_kept":85,"cut":false,"hidden":false,"merged":[[0,2,0,4],[0,7,0,8],[0,15,0,17],[1,2,1,4],[1,7,1,8],[1,15,1,17],[82,1,82,17],[4,9,4,17],[2,2,2,4],[2,15,2,17],[4,1,4,3],[4,4,4,5],[4,7,4,8],[57,0,57,15],[63,0,63,17],[64,0,64,17],[81,1,81,17]]}
[null,"PROJECT Reference :",{"$f":"'Individual Cost Statement'!B3:B3","v":"LIFEXX XXX/XX/XXXXXX - ACRONYM"},null,null,null,null,"PERIOD (FROM) :",null,{"$f":"'Individual Cost Statement'!E3:E3","v":"00:00:00"},null,null,null,null,null,"Land lease/One-off Compensation"]
[null,"COUNTRY :",{"$f":"'Individual Cost Statement'!B4:B4","v":"Austria"},null,null,null,null,"PERIOD (TO) :",null,{"$f":"'Individual Cost Statement'!E4:E4","v":"00:00:00"},null,null,null,null,null,"Amount WITH NON-recoverable VAT"]
[null,"Beneficiary: ",{"$f":"'Individual Cost Statement'!B6:B6","v":0},null,null,null,null,null,null,null,null,null,null,null,null,{"$f":"R58","v":0}]
[]
[null,"Info on land",null,null,"Info on lease contract",null,"Info on one-off compensation for land use rights ","Invoice/receipt",null,"Calculation of the LEASE OF LAND costs"]
["A","B1","B2","B3","C1","C2","D","E1","E2","F1","F2","F3","F4","F5","F6","F7","F8","F9"]
{"$rows_left_out":80}
{"sheet":"Consumables","index":10,"n_rows":79,"n_cols":15,"rows_kept":79,"cut":false,"hidden":false,"merged":[[0,8,0,10],[1,8,1,10],[2,8,2,10],[65,1,65,10],[57,0,57,8],[0,2,0,4],[1,2,1,4],[2,2,2,4],[4,4,4,5],[4,1,4,3],[78,1,78,11],[74,1,74,11],[75,1,75,11],[4,6,4,10],[63,0,63,11],[64,0,64,11],[69,1,69,11]]}
[null,"PROJECT Reference :",{"$f":"'Individual Cost Statement'!B3:B3","v":"LIFEXX XXX/XX/XXXXXX - ACRONYM"},null,null,null,"PERIOD (FROM) :",{"$f":"'Individual Cost Statement'!E3:E3","v":"00:00:00"},"CONSUMABLES"]
[null,"COUNTRY :",{"$f":"'Individual Cost Statement'!B4:B4","v":"Austria"},null,null,null,"PERIOD (TO) :",{"$f":"'Individual Cost Statement'!E4:E4","v":"00:00:00"},"Amount WITH NON-recoverable VAT"]
[null,"Beneficiary: ",{"$f":"'Individual Cost Statement'!B6:B6","v":0},null,null,null,null,null,{"$f":"K58","v":0}]
[]
[null,"Details on cost item",null,null,"Info on cost item",null,"Calculation of the CONSUMABLE costs",null,null,null,null,"Selection procedure"]
["A","B1","B2","B3","C1","C2","D1","D2","D3","D4","D5","E"]
{"$rows_left_out":74}
{"sheet":"Other direct costs","index":11,"n_rows":79,"n_cols":15,"rows_kept":79,"cut":false,"hidden":false,"merged":[[0,8,0,10],[1,8,1,10],[2,8,2,10],[65,1,65,10],[57,0,57,8],[4,6,4,10],[0,2,0,4],[1,2,1,4],[2,2,2,4],[4,4,4,5],[78,1,78,11],[74,1,74,11],[75,1,75,11],[4,1,4,3],[63,0,63,11],[64,0,64,11],[69,1,69,11]]}
[null,"PROJECT Reference :",{"$f":"'Individual Cost Statement'!B3:B3","v":"LIFEXX XXX/XX/XXXXXX - ACRONYM"},null,null,null,"PERIOD (FROM) :",{"$f":"'Individual Cost Statement'!E3:E3","v":"00:00:00"},"OTHER DIRECT COSTS"]
[null,"COUNTRY :",{"$f":"'Individual Cost Statement'!B4:B4","v":"Austria"},null,null,null,"PERIOD (TO) :",{"$f":"'Individual Cost Statement'!E4:E4","v":"00:00:00"},"Amount WITH NON-recoverable VAT"]
[null,"Beneficiary: ",{"$f":"'Individual Cost Statement'!B6:B6","v":0},null,null,null,null,null,{"$f":"K58","v":0}]
[]
[null,"Details on cost item",null,null,"Info on cost item",null,"Calculation of the OTHER DIRECT costs",null,null,null,null,"Selection procedure"]
["A","B1","B2","B3","C1","C2","D1","D2","D3","D4","D5","E"]
{"$rows_left_out":74}
{"sheet":"Funding","index":12,"n_rows":47,"n_cols":7,"rows_kept":47,"cut":false,"hidden":false,"merged":[[14,1,14,5],[21,1,21,4],[2,2,2,4],[1,2,1,4],[0,2,0,4],[46,1,46,4],[34,1,34,5],[24,1,24,5],[4,1,4,5],[11,1,11,4],[31,1,31,4],[5,1,5,4],[6,1,6,4],[7,1,7,4],[8,1,8,4],[9,1,9,4],[10,1,10,4]]}
[null,"PROJECT Reference :",{"$f":"'Individual Cost Statement'!B3:B3","v":"LIFEXX XXX/XX/XXXXXX - ACRONYM"},null,null,"PERIOD (FROM) :",{"$f":"'Individual Cost Statement'!E3:E3","v":"00:00:00"}]
[null,"COUNTRY :",{"$f":"'Individual Cost Statement'!B4:B4","v":"Austria"},null,null,"PERIOD (TO) :",{"$f":"'Individual Cost Statement'!E4:E4","v":"00:00:00"}]
[null,"Beneficiary: ",{"$f":"'Individual Cost Statement'!B6:B6","v":0}]
[]
[null,"Requested Union Contribution"]
[null,{"$f":"IF(ISBLANK('Individual Cost Statement'!B7:B7),\" \", IF('Individual Cost Statement'!B7:B7=\"COORDINATING beneficiary\", \"List of payments received and expected from EC/EASME\",\"List of payments received and expected from the Coordinating Beneficiary\"))","v":"List of payments received and expected from EC/EASME"},null,null,null,"Amount of co-funding in €"]
{"$rows_left_out":42}
{"sheet":"Certificate_NATURE_projects","index":13,"n_rows":16,"n_cols":4,"rows_kept":16,"cut":false,"hidden":true,"merged":[[5,0,5,2],[5,3,5,7],[6,3,6,7],[0,0,0,7],[2,0,2,2],[2,3,2,7],[3,0,3,2],[3,3,3,7],[6,0,6,2],[10,0,10,7],[11,0,11,2],[11,3,11,7],[8,0,8,7],[15,0,15,2],[15,3,15,7],[12,0,12,2],[12,3,12,7],[13,0,13,2],[13,3,13,7],[14,0,14,2],[14,3,14,7]]}
["Beneficiary's Certificate for NATURE and BIODIVERSITY Projects"]
[]
["Project reference",null,null,{"$f":"'Individual Cost Statement'!B3:B3","v":"LIFEXX XXX/XX/XXXXXX - ACRONYM"}]
["Full name of beneficiary",null,null,{"$f":"'Individual Cost Statement'!B6:B6","v":0}]
[]
["PERIOD (FROM) :",null,null,{"$f":"'Individual Cost Statement'!E3:E3","v":"00:00:00"}]
{"$rows_left_out":11}
{"sheet":"Certificate_INTEGRATED_projects","index":14,"n_rows":16,"n_cols":4,"rows_kept":16,"cut":false,"hidden":true,"merged":[[5,0,5,2],[5,3,5,7],[0,0,0,7],[2,0,2,2],[2,3,2,7],[3,0,3,2],[3,3,3,7],[6,0,6,2],[6,3,6,7],[8,0,8,7],[10,0,10,7],[11,0,11,2],[11,3,11,7],[15,0,15,2],[15,3,15,7],[12,0,12,2],[12,3,12,7],[13,0,13,2],[13,3,13,7],[14,0,14,2],[14,3,14,7]]}
["Beneficiary's Certificate for INTEGRATED Projects"]
[]
["Project reference",null,null,{"$f":"'Individual Cost Statement'!B3:B3","v":"LIFEXX XXX/XX/XXXXXX - ACRONYM"}]
["Full name of beneficiary",null,null,{"$f":"'Individual Cost Statement'!B6:B6","v":0}]
[]
["PERIOD (FROM) :",null,null,{"$f":"'Individual Cost Statement'!E3:E3","v":"00:00:00"}]
{"$rows_left_out":11}
{"sheet":"VAT_Calculation","index":15,"n_rows":23,"n_cols":3,"rows_kept":23,"cut":false,"hidden":true,"merged":[[8,1,8,2]]}
[null,"PROJECT Reference :",{"$f":"'Individual Cost Statement'!B3:B3","v":"LIFEXX XXX/XX/XXXXXX - ACRONYM"}]
[null,"COUNTRY :",{"$f":"'Individual Cost Statement'!B4:B4","v":"Austria"}]
[null,"Beneficiary: ",{"$f":"'Individual Cost Statement'!B6:B6","v":0}]
[]
[null,"PERIOD (FROM) :",{"$f":"'Individual Cost Statement'!E3:E3","v":"00:00:00"}]
[null,"PERIOD (TO) :",{"$f":"'Individual Cost Statement'!E4:E4","v":"00:00:00"}]
{"$rows_left_out":18}
{"sheet":"LISTS","index":16,"n_rows":167,"n_cols":15,"rows_kept":167,"cut":false,"hidden":true,"merged":[]}
["Austria","AT",null,null,null,"Code","Currency",null,null,null,"Procurement procedure",null,null,null,"Strand types"]
["Belgium","BE",null,null,null,null,null,null,null,null,"Publ. Procuremt-direct award",null,null,null,"CAPACITY BUILDING - CAP"]
["Bulgaria","BG",null,null,null,"EUR","Euro",null,null,null,"Publ. Procuremt-negotiated procedure",null,null,null,"CLIMA - CCA"]
["Croatia","HR",null,null,null,null,null,null,null,null,"Publ. Procuremt-restricted procedure",null,null,null,"CLIMA - CCM"]
["Cyprus","CY",null,null,null,"BGN","Bulgarian lev",null,null,null,"Publ. Procuremt-open procedure",null,null,null,"CLIMA - GIC"]
["Czech Republic","CZ",null,null,null,"CZK","Czech koruna",null,null,null,"Direct award",null,null,null,"ENVIRONMENT - ENV"]
{"$rows_left_out":161}